{"text_format":"1","workbook":"xlsx","n_sheets":25,"sheets":["MENU","PANORAMA MUNDIAL ","PANORAMA MUNDIAL 1.1","MOVIMIENTOS - LLEGADAS","MOVIMIENTOS - SALIDAS","MOV. AÑOS Y MESES","M CLAVES","M CONSOLIDACION","M OPORTUNIDAD","EXPLICACION VARIACIONES","GRAFICO M CLAVE","GRAFICO M CONSOLIDACION","GRAFICO M OPORTUNIDAD","MOV.JEFATURAS ENTRADAS","MOV.JEFATURAS SALIDAS","LLEGADA PAIS NACIONALIDAD TOTAL","LLEGADAS EXTRANJEROS","SALIDAS ECUATORIANOS","INGRESO Y EGRESO DE DIVISAS","UBICACION DEL TURISMO I Semest","UBICACION DEL TURISMO ","ENTRADAS MERCADOS TURISTICOS","SALIDAS MERCADOS TURISTICOS","Framework","Hoja1"],"not_rendered":{"charts":13,"images":21,"macros":1,"external_links":4,"defined_names":23,"comments":0,"pivot_tables":0},"unopened":[],"bounds":{"document_bytes":16777216,"sheet_cells":100000,"rows_first":2000,"rows_last":500,"rows_between":2000,"halvings":0,"cell_chars":16384,"cell_head_chars":4096},"cells_cut":0,"cells_raw":0,"read":"whole","date_system":"1900"}

{"sheet":"MENU","index":0,"n_rows":0,"n_cols":0,"rows_kept":0,"cut":false,"hidden":false,"merged":[]}

{"sheet":"PANORAMA MUNDIAL ","index":1,"n_rows":32,"n_cols":18,"rows_kept":32,"cut":false,"hidden":false,"merged":[[9,3,9,8],[10,12,10,17],[12,12,12,13],[12,16,12,17],[11,12,11,15],[12,14,12,15],[11,16,11,17],[11,4,13,4],[11,5,12,6],[11,7,12,8],[10,2,10,8]]}
[]
[]
[]
[]
[]
[]
[]
[]
[]
[]
[null,null,"Llegadas de turistas internacionales",null,null,null,null,null,null,null,null,null,"Ingresos por turismo internacional"]
[null,null,null,null,"Series (1)","(Millones)",null,"Variación (%)",null,null,null,null,"$ EE.UU.",null,null,null,"Monedas Locales"]
[null,null,null,null,null,null,null,null,null,null,null,null,"Miles de millones",null,"Variación (%)",null,"Variación (%)"]
[null,null,"Rango",null,null,2011,"2012*"," 11/10"," 12*/11",null,"Rango",null,2011,"2012*"," 11/10"," 12*/11"," 11/10"," 12*/11"]
[null,null,1,"Francia","TF",81.599999999999994,83,5,1.8,null,1,"Estados Unidos",115.6,126.2,11.7,9.1999999999999993,11.7,9.1999999999999993]
{"$rows_left_out":18}
{"sheet":"PANORAMA MUNDIAL 1.1","index":2,"n_rows":27,"n_cols":9,"rows_kept":27,"cut":false,"hidden":true,"merged":[[10,4,10,7],[9,4,9,7]]}
[]
[]
[]
[]
[]
[]
[]
[]
[null,null,null,null,2008,2009,2010,2011,"2012*"]
[null,null,null,null,"Real",null,null,null,"Proyección"]
[null,null,null,null,"año completo, variación",null,null,null,"entre"]
[]
[null,null,null,"MUNDO",2.1000000000000001E-2,-3.7999999999999999E-2,6.5000000000000002E-2,4.3999999999999997E-2," +3%  y +4%"]
[]
[null,null,null,"Europa",5.0000000000000001E-3,-4.9000000000000002E-2,2.9000000000000001E-2,0.06," +2%  y +4%"]
{"$rows_left_out":13}
{"sheet":"MOVIMIENTOS - LLEGADAS","index":3,"n_rows":44,"n_cols":15,"rows_kept":44,"cut":false,"hidden":false,"merged":[[9,8,11,8],[9,4,11,4],[9,5,11,5],[9,6,11,6],[9,7,11,7]]}
[]
[]
[]
[]
[]
[]
[]
[]
[]
[null,null,null,null,"MES",2009,2010,2011,2012]
[null,null,null,null,null,null,null,null,null,2013,"VAR%"]
[null,null,null,null,null,null,null,null,null,null,"2013/2012"]
[null,null,null,null,"ENE",86544,96109,105548,127116,130842,{"$f":"+J13/I13*100-100","v":2.9311809685641492}]
[null,null,null,null,"FEB",72742,89924,86421,99521,103768,4.2674410425940152]
[null,null,null,null,"MAR",72226,82452,87495,96948,113361,16.929694269092693]
{"$rows_left_out":30}
{"sheet":"MOVIMIENTOS - SALIDAS","index":4,"n_rows":45,"n_cols":15,"rows_kept":45,"cut":false,"hidden":false,"merged":[[9,7,11,7],[9,8,11,8],[9,4,11,4],[9,5,11,5],[9,6,11,6]]}
[]
[]
[]
[]
[]
[]
[]
[]
[]
[null,null,null,null,"MESES",2009,2010,2011,2012,null,"VAR%"]
[null,null,null,null,null,null,null,null,null,2013,"2013/2012"]
[null,null,null,null,"ENE",68480,67521,71172,69602]
[null,null,null,null,"ENE",67521,71172,69601,77532,79108,{"$f":"+J13/I13*100-100","v":2.0327090749625967}]
[null,null,null,null,"FEB",72591,74436,68524,90608,94464,4.2556948613808885]
[null,null,null,null,"MAR",75150,81686,89613,91453,98292,7.4781581796113983]
{"$rows_left_out":31}
{"sheet":"MOV. AÑOS Y MESES","index":5,"n_rows":47,"n_cols":21,"rows_kept":47,"cut":false,"hidden":true,"merged":[[26,0,26,6],[0,0,1,6],[5,0,5,6],[3,0,3,6],[2,0,2,6],[6,0,8,0],[6,1,8,1],[6,2,8,2],[6,3,8,3],[6,4,8,4],[6,5,8,5]]}
["ENTRADAS Y SALIDAS EN EL ECUADOR"]
[]
["2009-2012"]
["( DATOS PROVISIONALES PARA LOS AÑOS  2012 Y 2013)"]
[]
["LLEGADA DE EXTRANJEROS"]
[null,2009,2010,2011,2012,2013,"VAR%",null,2012,"BRECHA %"]
[null,null,null,null,null,null,"VAR%",null,null,"VAR%"]
[null,null,null,null,null,null,"2013/2012",null,"PMTE (o)","REAL / PMTE (o)",null,null,null,null,null,null,null,null,2011,2012]
["ENE",86544,96109,105548,127116,130842,{"$f":"+F10/E10*100-100","v":2.9311809685641492},null,109163,{"$f":"+E10/I10*100-100","v":16.44604856957028},null,null,null,null,null,null,null,"ENE",105548,127119,{"$f":"+T10/S10-1","v":0.20437147080001505}]
["FEB",72742,89924,86421,99521,103768,4.2674410425940152,null,92534,7.5507381070741673,null,null,null,null,null,null,null,"FEB",86421,99551,0.15193066500040509]
["MAR",72226,82452,87495,96948,113361,16.929694269092693,null,95711,1.2924324267848135,null,null,null,null,null,null,null,"MAR",87495,96975,0.10834904851705818]
["ABR",72910,70540,87507,92627,89669,-3.1934533127489857,null,86769,6.7512590902280749,null,null,null,null,null,null,null,"ABR",87507,92627,5.850960494588997E-2]
["MAY",70277,77618,82870,92644,98420,6.2346185397867089,null,88731,4.4099581882318404,null,null,null,null,null,null,null,"MAY",82870,92646,0.11796790153252079]
["JUN",89889,91602,99949,118292,121742,2.9165116829540381,null,108071,9.4576713456894055,null,null,null,null,null,null,null,"JUN",99949,118293,0.18353360213708991]
{"$rows_left_out":33}
{"sheet":"M CLAVES","index":6,"n_rows":33,"n_cols":12,"rows_kept":33,"cut":false,"hidden":false,"merged":[[26,3,30,3],[31,4,31,5],[32,4,32,5],[25,10,25,11]]}
[]
[]
[]
[]
[]
[]
[]
[]
[]
[]
[]
[]
[]
[]
[]
{"$rows_left_out":19}
{"sheet":"M CONSOLIDACION","index":7,"n_rows":32,"n_cols":12,"rows_kept":32,"cut":false,"hidden":false,"merged":[[22,3,29,3],[30,4,30,5],[31,4,31,5],[21,10,21,11]]}
[]
[]
[]
[]
[]
[]
[]
[]
[]
[]
[]
[]
[]
[]
[]
{"$rows_left_out":18}
{"sheet":"M OPORTUNIDAD","index":8,"n_rows":26,"n_cols":12,"rows_kept":26,"cut":false,"hidden":false,"merged":[[18,3,24,3],[24,4,24,5],[25,4,25,5],[17,10,17,11]]}
[]
[]
[]
[]
[]
[]
[]
[]
[]
[]
[]
[]
[]
[]
[]
{"$rows_left_out":12}
{"sheet":"EXPLICACION VARIACIONES","index":9,"n_rows":76,"n_cols":9,"rows_kept":76,"cut":false,"hidden":true,"merged":[[67,1,73,1],[74,2,74,3],[75,2,75,3],[22,1,26,1],[27,2,27,3],[28,2,28,3],[45,1,52,1],[53,2,53,3],[54,2,54,3]]}
[]
[]
[]
[]
[]
[]
[]
[]
[]
[]
[]
[]
[]
[]
[]
{"$rows_left_out":62}
{"sheet":"GRAFICO M CLAVE","index":10,"n_rows":0,"n_cols":0,"rows_kept":0,"cut":false,"hidden":false,"merged":[]}

{"sheet":"GRAFICO M CONSOLIDACION","index":11,"n_rows":0,"n_cols":0,"rows_kept":0,"cut":false,"hidden":false,"merged":[]}

{"sheet":"GRAFICO M OPORTUNIDAD","index":12,"n_rows":0,"n_cols":0,"rows_kept":0,"cut":false,"hidden":false,"merged":[]}

{"sheet":"MOV.JEFATURAS ENTRADAS","index":13,"n_rows":39,"n_cols":18,"rows_kept":39,"cut":false,"hidden":false,"merged":[[23,16,23,17],[23,4,23,5],[23,6,23,7],[23,8,23,9],[23,10,23,11],[23,12,23,13],[23,14,23,15],[9,14,9,15],[9,4,9,5],[9,6,9,7],[9,8,9,9],[9,10,9,11],[9,12,9,13],[10,3,11,3],[10,4,11,4],[10,5,11,5],[10,6,11,6],[10,7,11,7],[10,8,11,8],[10,9,11,9],[10,10,11,10],[10,11,11,11],[10,12,11,12],[10,13,11,13],[10,14,11,14],[10,15,11,15],[19,3,20,3],[19,4,20,4],[19,5,20,5],[19,6,20,6],[19,7,20,7],[19,8,20,8],[19,9,20,9],[19,10,20,10],[19,11,20,11],[19,12,20,12],[19,13,20,13],[19,14,20,14],[19,15,20,15],[24,3,25,3],[24,4,25,4],[24,5,25,5],[24,6,25,6],[24,7,25,7],[24,13,25,13],[24,14,25,14],[24,15,25,15],[24,8,25,8],[24,9,25,9],[24,10,25,10],[24,11,25,11],[24,12,25,12]]}
[]
[]
[]
[]
[]
[]
[]
[]
[]
[null,null,null,null,"ENE",null,"FEB",null,"MAR",null,"ABR",null,"MAY",null,"JUN"]
[null,null,null,"JEFATURAS",2012,2013,2012,2013,2012,2013,2012,2013,2012,2013,2012,2013]
[]
[]
[null,null,null,"PICHINCHA",41586,48061,38318,43488,41449,51320,38157,43055,41462,48524,53077,58930]
[null,null,null,"GUAYAS",32169,27662,28608,26403,26352,26884,21841,22168,23220,23871,27724,29966]
{"$rows_left_out":25}
{"sheet":"MOV.JEFATURAS SALIDAS","index":14,"n_rows":39,"n_cols":18,"rows_kept":39,"cut":false,"hidden":false,"merged":[[24,13,25,13],[24,14,25,14],[24,15,25,15],[24,8,25,8],[24,9,25,9],[24,10,25,10],[24,11,25,11],[24,12,25,12],[24,3,25,3],[24,4,25,4],[24,5,25,5],[24,6,25,6],[24,7,25,7],[10,14,11,14],[10,15,11,15],[19,3,20,3],[19,4,20,4],[19,5,20,5],[19,6,20,6],[19,7,20,7],[19,8,20,8],[19,9,20,9],[19,10,20,10],[19,11,20,11],[19,12,20,12],[19,13,20,13],[19,14,20,14],[19,15,20,15],[10,9,11,9],[10,10,11,10],[10,11,11,11],[10,12,11,12],[10,13,11,13],[10,3,11,3],[10,4,11,4],[10,5,11,5],[10,6,11,6],[10,7,11,7],[23,16,23,17],[39,14,40,14],[39,15,39,16],[9,4,9,5],[9,6,9,7],[9,8,9,9],[9,10,9,11],[9,12,9,13],[9,14,9,15],[23,4,23,5],[23,6,23,7],[23,8,23,9],[23,10,23,11],[23,12,23,13],[23,14,23,15],[10,8,11,8]]}
[]
[]
[]
[]
[]
[]
[]
[]
[]
[null,null,null,null,"ENE",null,"FEB",null,"MAR",null,"ABR",null,"MAY",null,"JUN"]
[null,null,null,"JEFATURAS",2012,2013,2012,2013,2012,2013,2012,2013,2012,2013,2012,2013]
[]
[]
[null,null,null,"PICHINCHA",28207,31539,30411,35938,34400,32343,34713,35570,37677,37754,29578,30223]
[null,null,null,"GUAYAS",37067,35898,42776,40999,44232,49685,34877,44998,33355,39640,27246,33674]
{"$rows_left_out":25}
{"sheet":"LLEGADA PAIS NACIONALIDAD TOTAL","index":15,"n_rows":243,"n_cols":33,"rows_kept":243,"cut":false,"hidden":false,"merged":[[10,31,10,32],[10,4,10,5],[10,6,10,7],[10,8,10,9],[10,10,10,11],[10,12,10,13],[10,14,10,15],[10,16,10,17],[10,18,10,19],[10,20,10,21],[10,22,10,23],[10,24,10,25],[10,26,10,27],[240,3,240,5],[241,3,241,4],[10,28,10,29],[11,3,12,3]]}
[]
[]
[]
[]
[]
[]
[]
[]
[]
[]
[null,null,null,null,"ENERO",null,"FEBRERO",null,"MARZO",null,"ABRIL",null,"MAY",null,"JUN",null,"JUL",null,"AGO",null,"SEP",null,"OCT",null,"NOV",null,"DIC",null,"Acumulado Ene-Dic",null,null,"%"]
[null,null,null,"PAIS","ECUATORIANOS","EXTRANJEROS","ECUATORIANOS","EXTRANJEROS","ECUATORIANOS","EXTRANJEROS","ECUATORIANOS","EXTRANJEROS","ECUATORIANOS","EXTRANJEROS","ECUATORIANOS","EXTRANJEROS","ECUATORIANOS","EXTRANJEROS","ECUATORIANOS","EXTRANJEROS","ECUATORIANOS","EXTRANJEROS","ECUATORIANOS","EXTRANJEROS","ECUATORIANOS","EXTRANJEROS","ECUATORIANOS","EXTRANJEROS","ECUATORIANOS","EXTRANJEROS",null,"ECUATORIANOS","EXTRANJEROS"]
[null,null,null,null,"SALIDA","ENTRADA","SALIDA","ENTRADA","SALIDA","ENTRADA","SALIDA","ENTRADA","SALIDA","ENTRADA","SALIDA","ENTRADA","SALIDA","ENTRADA","SALIDA","ENTRADA","SALIDA","ENTRADA","SALIDA","ENTRADA","SALIDA","ENTRADA","SALIDA","ENTRADA","SALIDA","ENTRADA",null,"SALIDA","ENTRADA"]
[null,null,null,"AFGANISTAN",1,0,0,3,0,16,1,0,0,0,4,0,0,0,1,0,0,1,0,5,1,0,0,0,{"$f":"+E14+G14+I14+K14+M14+O14+Q14+S14+U14+W14+Y14+AA14","v":8},{"$f":"+F14+H14+J14+L14+N14+P14+R14+T14+V14+X14+Z14+AB14","v":25},null,{"$f":"+AC14/AC$239*100","v":6.9230383138247883E-4},{"$f":"+AD14/AD$239*100","v":1.8298007200631794E-3}]
[null,null,null,"AFRICA SUD OCCIDENTAL",5,37,15,44,13,72,11,61,17,61,7,58,9,64,19,72,7,62,9,51,20,65,5,91,{"$f":"+E15+G15+I15+K15+M15+O15+Q15+S15+U15+W15+Y15+AA15","v":137},{"$f":"+F15+H15+J15+L15+N15+P15+R15+T15+V15+X15+Z15+AB15","v":738},null,{"$f":"+AC15/AC$239*100","v":1.185570311242495E-2},{"$f":"+AD15/AD$239*100","v":5.4015717256265056E-2}]
{"$rows_left_out":229}
{"sheet":"LLEGADAS EXTRANJEROS","index":16,"n_rows":234,"n_cols":20,"rows_kept":234,"cut":false,"hidden":false,"merged":[]}
[]
[]
[]
[]
[]
[]
[]
[]
[]
[]
[null,null,null,null,null,"ENTRADA","ENTRADA","ENTRADA","ENTRADA","ENTRADA","ENTRADA","ENTRADA","ENTRADA","ENTRADA","ENTRADA","ENTRADA","ENTRADA","ENTRADA",null,"ENTRADA"]
[null,null,null,"RK","PAIS","ENE","FEB","MAR","ABR","MAY","JUN","JUL","AGO","SEP","OCT","NOV","DIC","Acumulado Ene-Dic",null,"%"]
[null,null,null,1,"COLOMBIA",46006,21340,31800,21035,23069,31197,35036,22168,21809,{"$f":"VLOOKUP(E13,'LLEGADA PAIS NACIONALIDAD TOTAL'!$D$14:$X$238,21,0)","v":25426},{"$f":"VLOOKUP(E13,'LLEGADA PAIS NACIONALIDAD TOTAL'!$D$14:$Z$238,23,0)","v":24581},{"$f":"VLOOKUP(E13,'LLEGADA PAIS NACIONALIDAD TOTAL'!$D$14:$AB$238,25,0)","v":40896},{"$f":"SUM(F13:Q13)","v":344363},null,{"$f":"+R13/R$232*100","v":25.204626614524667}]
[null,null,null,2,"ESTADOS UNIDOS",19066,18900,21984,15382,19921,31587,30504,22786,14066,{"$f":"VLOOKUP(E14,'LLEGADA PAIS NACIONALIDAD TOTAL'!$D$14:$X$238,21,0)","v":16004},{"$f":"VLOOKUP(E14,'LLEGADA PAIS NACIONALIDAD TOTAL'!$D$14:$Z$238,23,0)","v":15963},{"$f":"VLOOKUP(E14,'LLEGADA PAIS NACIONALIDAD TOTAL'!$D$14:$AB$238,25,0)","v":24622},250785,null,{"$f":"+R14/R$232*100","v":18.355462943241776}]
[null,null,null,3,"PERÚ",14211,14852,11264,9327,10278,9880,13891,14019,11340,{"$f":"VLOOKUP(E15,'LLEGADA PAIS NACIONALIDAD TOTAL'!$D$14:$X$238,21,0)","v":15189},{"$f":"VLOOKUP(E15,'LLEGADA PAIS NACIONALIDAD TOTAL'!$D$14:$Z$238,23,0)","v":13798},{"$f":"VLOOKUP(E15,'LLEGADA PAIS NACIONALIDAD TOTAL'!$D$14:$AB$238,25,0)","v":12756},150805,null,11.03772390356511]
{"$rows_left_out":220}
{"sheet":"SALIDAS ECUATORIANOS","index":17,"n_rows":239,"n_cols":20,"rows_kept":239,"cut":false,"hidden":false,"merged":[]}
[]
[]
[]
[]
[]
[]
[]
[]
[]
[]
[null,null,null,null,null,"SALIDA","SALIDA","SALIDA","SALIDA","SALIDA","SALIDA","SALIDA","SALIDA","SALIDA","SALIDA","SALIDA","SALIDA","SALIDA",null,"SALIDA"]
[null,null,null,"RK","PAIS","ENERO","FEBRERO","MARZO","ABRIL","MAY","JUN","JUL","AGO","SEP","OCT","NOV","DIC","Acumulado Ene-Dic",null,"%"]
[null,null,null,1,"ESTADOS UNIDOS",25192,32666,36111,33434,{"$f":"VLOOKUP(E13,'LLEGADA PAIS NACIONALIDAD TOTAL'!$D$14:$AD$238,10,0)","v":32202},{"$f":"+VLOOKUP(E13,'LLEGADA PAIS NACIONALIDAD TOTAL'!$D$14:$AD$238,12,0)","v":25251},34068,{"$f":"VLOOKUP(E13,'LLEGADA PAIS NACIONALIDAD TOTAL'!$D$14:$T$238,16,0)","v":42883},36736,{"$f":"VLOOKUP(E13,'LLEGADA PAIS NACIONALIDAD TOTAL'!$D$14:$W$238,20,0)","v":34046},{"$f":"VLOOKUP(E13,'LLEGADA PAIS NACIONALIDAD TOTAL'!$D$14:$Z$238,22,0)","v":33883},{"$f":"VLOOKUP(E13,'LLEGADA PAIS NACIONALIDAD TOTAL'!$D$14:$AB$238,24,0)","v":28599},{"$f":"SUM(F13:Q13)","v":395071},null,{"$f":"+R13/R$235*100","v":34.188675457202173}]
[null,null,null,2,"PERÚ",12972,18155,16821,16490,{"$f":"VLOOKUP(E14,'LLEGADA PAIS NACIONALIDAD TOTAL'!$D$14:$AD$238,10,0)","v":13649},{"$f":"+VLOOKUP(E14,'LLEGADA PAIS NACIONALIDAD TOTAL'!$D$14:$AD$238,12,0)","v":14960},16309,{"$f":"VLOOKUP(E14,'LLEGADA PAIS NACIONALIDAD TOTAL'!$D$14:$T$238,16,0)","v":25819},15811,{"$f":"VLOOKUP(E14,'LLEGADA PAIS NACIONALIDAD TOTAL'!$D$14:$W$238,20,0)","v":19075},{"$f":"VLOOKUP(E14,'LLEGADA PAIS NACIONALIDAD TOTAL'!$D$14:$Z$238,22,0)","v":15556},{"$f":"VLOOKUP(E14,'LLEGADA PAIS NACIONALIDAD TOTAL'!$D$14:$AB$238,24,0)","v":17557},203174,null,{"$f":"+R14/R$235*100","v":17.582282545014934}]
[null,null,null,3,"COLOMBIA",7798,8674,8069,9964,{"$f":"VLOOKUP(E15,'LLEGADA PAIS NACIONALIDAD TOTAL'!$D$14:$AD$238,10,0)","v":9248},{"$f":"+VLOOKUP(E15,'LLEGADA PAIS NACIONALIDAD TOTAL'!$D$14:$AD$238,12,0)","v":7850},10187,{"$f":"VLOOKUP(E15,'LLEGADA PAIS NACIONALIDAD TOTAL'!$D$14:$T$238,16,0)","v":10204},9395,{"$f":"VLOOKUP(E15,'LLEGADA PAIS NACIONALIDAD TOTAL'!$D$14:$W$238,20,0)","v":9187},{"$f":"VLOOKUP(E15,'LLEGADA PAIS NACIONALIDAD TOTAL'!$D$14:$Z$238,22,0)","v":8127},{"$f":"VLOOKUP(E15,'LLEGADA PAIS NACIONALIDAD TOTAL'!$D$14:$AB$238,24,0)","v":8911},107614,null,9.3127061228269206]
{"$rows_left_out":225}
{"sheet":"INGRESO Y EGRESO DE DIVISAS","index":18,"n_rows":31,"n_cols":14,"rows_kept":31,"cut":false,"hidden":false,"merged":[[20,12,21,13],[26,3,27,3],[26,5,27,5],[26,6,27,6],[26,7,27,7],[26,8,27,8],[26,9,27,9],[26,10,27,10],[26,11,27,11],[26,12,27,12],[26,13,27,13],[16,10,17,10],[16,11,17,11],[19,3,21,3],[19,5,19,11],[20,5,20,6],[20,7,21,7],[20,8,20,9],[20,10,21,10],[20,11,21,11],[16,3,17,3],[16,5,17,5],[16,6,17,6],[16,7,17,7],[16,8,17,8],[16,9,17,9],[9,3,11,3],[9,5,9,11],[10,5,10,6],[10,7,11,7],[10,8,10,9],[10,10,11,10],[10,11,11,11]]}
[]
[]
[]
[]
[]
[]
[]
[]
[]
[null,null,null,"TRIMESTRES",null,2012]
[null,null,null,null,null,"INGRESOS (a)",null,"TOTAL DE INGRESOS DE DIVISAS ( a)","EGRESOS (b)",null,"TOTAL DE EGRESOS DE DIVISAS  (b)","SALDO   c = ( a - b )"]
[null,null,null,null,null,"VIAJES","TRANSPORTE",null,"VIAJES","TRANSPORTE"]
[null,null,null,"I TRIMESTRE",null,248.6,1.7,{"$f":"+F13+G13","v":250.29999999999998},150,78.599999999999994,{"$f":"+I13+J13","v":228.6},{"$f":"+H13-K13","v":21.699999999999989}]
[null,null,null,"II TRIMESTRE",null,255.4,1.6,{"$f":"+F14+G14","v":257},154,86.4,{"$f":"+I14+J14","v":240.4},{"$f":"+H14-K14","v":16.599999999999994}]
[null,null,null,"III TRIMESTRE",null,258,1.5,{"$f":"+F15+G15","v":259.5},152.5,86.7,{"$f":"+I15+J15","v":239.2},{"$f":"+H15-K15","v":20.300000000000011}]
{"$rows_left_out":17}
{"sheet":"UBICACION DEL TURISMO I Semest","index":19,"n_rows":34,"n_cols":13,"rows_kept":34,"cut":false,"hidden":false,"merged":[[14,12,14,13],[20,12,20,13],[9,3,11,3],[9,4,11,4],[9,5,11,5],[9,7,11,7],[9,12,9,13],[10,12,10,13],[11,12,11,13]]}
[]
[]
[]
[]
[]
[]
[]
[null,null," "]
[null,null,null,null,null,null,null,"(Mill. USD)"]
[null,null,null,"AÑOS/TRIM","* TURISMO","PETROLEO","BANANO Y","CAMARON","DERIVADOS","OTROS ELAB.","MANUFACT.","FLORES","TOTAL EXPORTACIONES "]
[null,null,null,null,null,"CRUDO","PLATANO",null,"PETROLEO","PROD. MAR","DE METALES","NATURALES","(Productos Primarios"]
[null,null,null,null,null,null,"      2)",null,"      3)",null,"        4)",null,"e Industrializados) "]
[]
[null,null,null,2012,507.3,6728.6,1134.2,656.4,676.9,514.4,308.7,407.3]
[null,null,null,null,null,null,null,null,null,null,null,null,12256.3]
{"$rows_left_out":20}
{"sheet":"UBICACION DEL TURISMO ","index":20,"n_rows":33,"n_cols":13,"rows_kept":33,"cut":false,"hidden":false,"merged":[[14,12,14,13],[20,12,20,13],[9,3,11,3],[9,4,11,4],[9,5,11,5],[9,7,11,7],[9,12,9,13],[10,12,10,13],[11,12,11,13]]}
[]
[]
[]
[]
[]
[]
[]
[]
[]
[null,null,null,"AÑOS","* TURISMO","PETROLEO  \nCRUDO","BANANO Y","CAMARON","DERIVADOS","OTROS ELAB.","MANUFACT.","FLORES","TOTAL EXPORTACIONES "]
[null,null,null,null,null,null,"PLATANO",null,"PETROLEO","PROD. MAR","DE METALES","NATURALES","(Productos Primarios"]
[null,null,null,null,null,null,"      2)",null,"      3)",null,"        4)",null,"e Industrializados) "]
[]
[null,null,null,2011,849.7,11799.97,2246.5,1178.4000000000001,1144.9000000000001,895.01,695.9,675.7]
[null,null,null,null,null,null,null,null,null,null,null,null,22322.400000000001]
{"$rows_left_out":19}
{"sheet":"ENTRADAS MERCADOS TURISTICOS","index":21,"n_rows":25,"n_cols":7,"rows_kept":25,"cut":false,"hidden":false,"merged":[[9,3,9,6]]}
[]
[]
[]
[]
[]
[]
[]
[]
[]
[null,null,null," ENERO -DICIEMBRE / 2012 - 2013"]
[null,null,null,"PRINCIPALES MERCADOS\nEMISORES",2012,2013,"Var% 2013/2012"]
[null,null,null,"Colombia",349455,{"$f":"VLOOKUP(D12,'LLEGADA PAIS NACIONALIDAD TOTAL'!$D$14:$AD$238,27,0)","v":344363},{"$f":"+F12/E12*100-100","v":-1.4571260963500237}]
[null,null,null,"Estados Unidos",248064,{"$f":"VLOOKUP(D13,'LLEGADA PAIS NACIONALIDAD TOTAL'!$D$14:$AD$238,27,0)","v":250785},1.0968943498452148]
[null,null,null,"Perú",137084,{"$f":"VLOOKUP(D14,'LLEGADA PAIS NACIONALIDAD TOTAL'!$D$14:$AD$238,27,0)","v":150805},10.009191444661653]
[null,null,null,"Venezuela",45701,{"$f":"VLOOKUP(D15,'LLEGADA PAIS NACIONALIDAD TOTAL'!$D$14:$AD$238,27,0)","v":102317},{"$f":"+F15/E15*100-100","v":123.88350364324631}]
{"$rows_left_out":11}
{"sheet":"SALIDAS MERCADOS TURISTICOS","index":22,"n_rows":28,"n_cols":7,"rows_kept":28,"cut":false,"hidden":false,"merged":[[11,3,11,6]]}
[]
[]
[]
[]
[]
[]
[]
[]
[]
[]
[]
[null,null,null," ENERO-DICIEMBRE / 2012 - 2013"]
[null,null,null,"PRINCIPALES MERCADOS\nRECEPTORES",2012,2013,"Var% 2013/2012"]
[null,null,null,"Estados Unidos",343310,{"$f":"VLOOKUP(D14,'LLEGADA PAIS NACIONALIDAD TOTAL'!$D$14:$AC$238,26,0)","v":395071},{"$f":"+F14/E14*100-100","v":15.077044070956276}]
[null,null,null,"Perú",177582,{"$f":"VLOOKUP(D15,'LLEGADA PAIS NACIONALIDAD TOTAL'!$D$14:$AC$238,26,0)","v":203174},14.41137052178712]
{"$rows_left_out":14}
{"sheet":"Framework","index":23,"n_rows":0,"n_cols":0,"rows_kept":0,"cut":false,"hidden":true,"merged":[]}

{"sheet":"Hoja1","index":24,"n_rows":0,"n_cols":0,"rows_kept":0,"cut":false,"hidden":true,"merged":[]}